BDBM50148633 CHEMBL3769697::US9518026, Example 42::US9956214, Compound 1591
SMILES CCOc1ccc2cc(cnc2c1)-c1nn(CC(C)(C)C)c(N)c1C(N)=O
InChI Key InChIKey=YXMBIJKVPSHQMB-UHFFFAOYSA-N
Data  5 IC50
  Tab Delimited (TSV)   2D SDfile   Computed 3D by Vconf -m prep SDfile
Find this compound or compounds like it in BindingDB:
Activity Spreadsheet -- Enzyme Inhibition Constant Data from BindingDB
Found 5 hits for monomerid = 50148633
TargetCalmodulin-domain protein kinase 1(Toxoplasma gondii)
University Of Washington
Curated by ChEMBL
LigandPNGBDBM50148633(CHEMBL3769697 | US9518026, Example 42 | US9956214,...)
Affinity DataIC50:  21nM. Assay description: Inhibition of Toxoplasma gondii CDPK1 assessed as ATP consumption using (Biotin-C6-PLARTLSVAGLPGKK) as substrate after 90 mins by luciferase reporter...
In DepthDetails ArticlePubMed
TargetCalmodulin-domain protein kinase 1(Toxoplasma gondii)
University Of Washington
Curated by ChEMBL
LigandPNGBDBM50148633(CHEMBL3769697 | US9518026, Example 42 | US9956214,...)
Affinity DataIC50:  28nM. Assay description: Inhibition of TgCDPK1 and CpCDPK1 was determined using a luminescent kinase assay which measures ATP depletion in the presence of the Syntide 2 pepti...
In DepthDetails US Patent
TargetCalcium-dependent protein kinase 1(Cryptosporidium parvum)
University Of Washington Through Its Center For Commercialization
US Patent
LigandPNGBDBM50148633(CHEMBL3769697 | US9518026, Example 42 | US9956214,...)
Affinity DataIC50:  7nM. Assay description: Inhibition of TgCDPK1 and CpCDPK1 was determined using a luminescent kinase assay which measures ATP depletion in the presence of the Syntide 2 pepti...
In DepthDetails US Patent
TargetCalmodulin-domain protein kinase 1(Toxoplasma gondii)
University Of Washington
Curated by ChEMBL
LigandPNGBDBM50148633(CHEMBL3769697 | US9518026, Example 42 | US9956214,...)
Affinity DataIC50:  21nM. Assay description: Inhibition of TgCDPK1 and CpCDPK1 was determined using a luminescent kinase assay which measures ATP depletion in the presence of the Syntide 2 pepti...
In DepthDetails US Patent
TargetUncharacterized protein(Cryptosporidium parvum)
University Of Washington Through Its Center For Commercialization
US Patent
LigandPNGBDBM50148633(CHEMBL3769697 | US9518026, Example 42 | US9956214,...)
Affinity DataIC50:  8nM. Assay description: Inhibition of TgCDPK1 and CpCDPK1 was determined using a luminescent kinase assay which measures ATP depletion in the presence of the Syntide 2 pepti...
In DepthDetails US Patent