BDBM50148973 3-{2-[2-(5-Bromo-2-methoxy-phenyl)-ethyl]-3-fluoro-phenyl}-6,7-dihydro-5H-pyrrolo[1,2-c]imidazole::CHEMBL123215
SMILES COc1ccc(Br)cc1CCc1c(F)cccc1-c1ncc2CCCn12
InChI Key InChIKey=QMFMUTNLPNHCJI-UHFFFAOYSA-N
Data  1 KI
  Tab Delimited (TSV)   2D SDfile   Computed 3D by Vconf -m prep SDfile
Find this compound or compounds like it in BindingDB:
Activity Spreadsheet -- Enzyme Inhibition Constant Data from BindingDB
Found 1 hit for monomerid = 50148973
TargetMelanocortin receptor 4(Homo sapiens (Human))
Millennium Pharmaceuticals
Curated by ChEMBL
LigandPNGBDBM50148973(3-{2-[2-(5-Bromo-2-methoxy-phenyl)-ethyl]-3-fluoro...)
Affinity DataKi:  320nM. Assay description: In vitro binding affinity towards melanocortin 4 receptor.
In DepthDetails ArticlePubMed