BDBM50149027 CHEMBL121686::Oxyguanidine derivative
SMILES CCCN(CC1CCC1)C(=O)c1cc(C)cc(OCCCONC(N)=N)c1
InChI Key InChIKey=VLBFOPQHCSDUFT-UHFFFAOYSA-N
Data  1 KI
  Tab Delimited (TSV)   2D SDfile   Computed 3D by Vconf -m prep SDfile
Find this compound or compounds like it in BindingDB:
Activity Spreadsheet -- Enzyme Inhibition Constant Data from BindingDB
Found 1 hit for monomerid = 50149027
TargetProthrombin(Homo sapiens (Human))
3-Dimensional Pharmaceuticals
Curated by ChEMBL
LigandPNGBDBM50149027(CHEMBL121686 | Oxyguanidine derivative)
Affinity DataKi:  17nM. Assay description: Inhibitory activity against thrombin
In DepthDetails ArticlePubMed