BDBM50149034 CHEMBL124164::Oxyguanidine derivative
SMILES NC(=N)NOCCCOc1cc(Cl)cc(c1)C(=O)N(CC1CC1)Cc1ccoc1
InChI Key InChIKey=GZLAIHVWGRPOIY-UHFFFAOYSA-N
Data  1 KI
  Tab Delimited (TSV)   2D SDfile   Computed 3D by Vconf -m prep SDfile
Find this compound or compounds like it in BindingDB:
Activity Spreadsheet -- Enzyme Inhibition Constant Data from BindingDB
Found 1 hit for monomerid = 50149034
TargetProthrombin(Homo sapiens (Human))
3-Dimensional Pharmaceuticals
Curated by ChEMBL
LigandPNGBDBM50149034(CHEMBL124164 | Oxyguanidine derivative)
Affinity DataKi:  17nM. Assay description: Inhibitory activity against thrombin
In DepthDetails ArticlePubMed