BDBM50149140 3-(Naphthalen-2-ylmethoxy)-1-aza-bicyclo[2.2.2]octane::CHEMBL125077
SMILES C(OC1CN2CCC1CC2)c1ccc2ccccc2c1
InChI Key InChIKey=XUMWAZQAZSWWDD-UHFFFAOYSA-N
Data  1 IC50
  Tab Delimited (TSV)   2D SDfile   Computed 3D by Vconf -m prep SDfile
Find this compound or compounds like it in BindingDB:
Activity Spreadsheet -- Enzyme Inhibition Constant Data from BindingDB
Found 1 hit for monomerid = 50149140
TargetNeuronal acetylcholine receptor subunit alpha-7(Rattus norvegicus (Rat))
Mitsubishi Pharma
Curated by ChEMBL
LigandPNGBDBM50149140(3-(Naphthalen-2-ylmethoxy)-1-aza-bicyclo[2.2.2]oct...)
Affinity DataIC50:  150nM. Assay description: Binding affinities of the compound for the alpha 7 nicotinic acetylcholine receptor was determined in PC12 cells
In DepthDetails ArticlePubMed