BDBM50149172 CHEMBL331317::Cyclopropanecarboxylic acid [3-(2-isopropyl-benzooxazol-7-yl)-propyl]-amide
SMILES CC(C)c1nc2cccc(CCCNC(=O)C3CC3)c2o1
InChI Key InChIKey=VVCQDZGJGLCJGR-UHFFFAOYSA-N
Data  2 KI
  Tab Delimited (TSV)   2D SDfile   Computed 3D by Vconf -m prep SDfile
Find this compound or compounds like it in BindingDB:
Activity Spreadsheet -- Enzyme Inhibition Constant Data from BindingDB
Found 2 hits for monomerid = 50149172
TargetMelatonin receptor type 1A(Homo sapiens (Human))
Bristol-Myers Squibb Pharmaceutical Research Institute
Curated by ChEMBL
LigandPNGBDBM50149172(CHEMBL331317 | Cyclopropanecarboxylic acid [3-(2-i...)
Affinity DataKi:  34nM. Assay description: Binding affinity against human Melatonin receptor type 1A by using 2-[125I]-iodomelatonin as radioligand
In DepthDetails ArticlePubMed
TargetMelatonin receptor type 1B(Homo sapiens (Human))
Bristol-Myers Squibb Pharmaceutical Research Institute
Curated by ChEMBL
LigandPNGBDBM50149172(CHEMBL331317 | Cyclopropanecarboxylic acid [3-(2-i...)
Affinity DataKi:  114nM. Assay description: Binding affinity against human Melatonin receptor type 1B by using 2-[125I]-iodomelatonin as radioligand
In DepthDetails ArticlePubMed