BDBM50149268 3-((S)-2-Amino-4-methyl-pentyl)-1-(2,6-difluoro-benzyl)-5-(2-fluoro-3-methoxy-phenyl)-6-methyl-1H-pyrimidine-2,4-dione::CHEMBL116259
SMILES COc1cccc(c1F)-c1c(C)n(Cc2c(F)cccc2F)c(=O)n(C[C@@H](N)CC(C)C)c1=O
InChI Key InChIKey=MAXNMKDHPDZTAV-INIZCTEOSA-N
Data  2 KI
  Tab Delimited (TSV)   2D SDfile   Computed 3D by Vconf -m prep SDfile
Find this compound or compounds like it in BindingDB:
Activity Spreadsheet -- Enzyme Inhibition Constant Data from BindingDB
Found 2 hits for monomerid = 50149268
TargetGonadotropin-releasing hormone receptor(Homo sapiens (Human))
Neurocrine Biosciences
Curated by ChEMBL
LigandPNGBDBM50149268(3-((S)-2-Amino-4-methyl-pentyl)-1-(2,6-difluoro-be...)
Affinity DataKi:  39nM. Assay description: Binding affinity for Human gonadotropin-releasing hormone receptor
In DepthDetails ArticlePubMed
TargetGonadotropin-releasing hormone receptor(Homo sapiens (Human))
Neurocrine Biosciences
Curated by ChEMBL
LigandPNGBDBM50149268(3-((S)-2-Amino-4-methyl-pentyl)-1-(2,6-difluoro-be...)
Affinity DataKi:  39nM. Assay description: Binding affinity towards human gonadotropin releasing hormone receptor using des-Gly10[125I-Tyr5,D-Leu6,NMeLeu7,Pro9-NEt]GnRH as radioligand expresse...
In DepthDetails ArticlePubMed