BDBM50149280 CHEMBL325696::[1-(4-tert-Butyl-benzyl)-6-(4-trifluoromethoxy-phenyl)-1H-indol-3-yl]-oxo-acetic acid
SMILES CC(C)(C)c1ccc(Cn2cc(C(=O)C(O)=O)c3ccc(cc23)-c2ccc(OC(F)(F)F)cc2)cc1
InChI Key InChIKey=NLVNELUZVSSGAO-UHFFFAOYSA-N
Data  1 IC50
  Tab Delimited (TSV)   2D SDfile   Computed 3D by Vconf -m prep SDfile
Find this compound or compounds like it in BindingDB:
Activity Spreadsheet -- Enzyme Inhibition Constant Data from BindingDB
Found 1 hit for monomerid = 50149280
TargetPlasminogen activator inhibitor 1(Homo sapiens (Human))
Wyeth Research
Curated by ChEMBL
LigandPNGBDBM50149280(CHEMBL325696 | [1-(4-tert-Butyl-benzyl)-6-(4-trifl...)
Affinity DataIC50: >5.00E+4nM. Assay description: Inhibition of human plasminogen activator inhibitor-1
In DepthDetails ArticlePubMed