BDBM50149483 CHEMBL3770325
SMILES CC(C)n1ncnc1-c1cn2CCOc3cc(ncc3-c2n1)N(C)CC(N)=O
InChI Key InChIKey=XDWOYXPZKCQIEF-UHFFFAOYSA-N
Data  1 KI
  Tab Delimited (TSV)   2D SDfile   Computed 3D by Vconf -m prep SDfile
Find this compound or compounds like it in BindingDB:
Activity Spreadsheet -- Enzyme Inhibition Constant Data from BindingDB
Found 1 hit for monomerid = 50149483
LigandPNGBDBM50149483(CHEMBL3770325)
Affinity DataKi:  0.200nM. Assay description: Inhibition of recombinant PI3K alpha (unknown origin) using PIP2 as substrate by fluorescence polarization assay
In DepthDetails ArticlePubMed