BDBM50149690 2-(4-Benzyl-piperidin-1-yl)-N-(4-hydroxy-phenyl)-2-oxo-acetamide::CHEMBL360373
SMILES Oc1ccc(NC(=O)C(=O)N2CCC(Cc3ccccc3)CC2)cc1
InChI Key InChIKey=SUUUWZXPEXVKGX-UHFFFAOYSA-N
Data  1 IC50
  Tab Delimited (TSV)   2D SDfile   Computed 3D by Vconf -m prep SDfile
Find this compound or compounds like it in BindingDB:
Activity Spreadsheet -- Enzyme Inhibition Constant Data from BindingDB
Found 1 hit for monomerid = 50149690
TargetGlutamate receptor ionotropic, NMDA 1/2B(Homo sapiens (Human))
Gedeon Richter
Curated by ChEMBL
LigandPNGBDBM50149690(2-(4-Benzyl-piperidin-1-yl)-N-(4-hydroxy-phenyl)-2...)
Affinity DataIC50:  31nM. Assay description: Inhibition of NMDA-evoked increased intracellular [Ca2+] in cells expressing NR1/NR2B receptor
In DepthDetails ArticlePubMed