BDBM50149912 CHEMBL3770657
SMILES Cc1c(Oc2nc3cnccc3c(=O)[nH]2)cnn1C
InChI Key InChIKey=GYVAZPHVLSLXDC-UHFFFAOYSA-N
Data  1 IC50
  Tab Delimited (TSV)   2D SDfile   Computed 3D by Vconf -m prep SDfile
Find this compound or compounds like it in BindingDB:
Activity Spreadsheet -- Enzyme Inhibition Constant Data from BindingDB
Found 1 hit for monomerid = 50149912
TargetLysine-specific demethylase 4C(Homo sapiens (Human))
Glaxosmithkline
Curated by ChEMBL
LigandPNGBDBM50149912(CHEMBL3770657)
Affinity DataIC50:  2.00E+3nM. Assay description: Inhibition of N-terminal his-tagged human KDM4C expressed in Escherichia coli BL21(DE3) using trimethylated peptide substrate by RFMS assay
In DepthDetails ArticlePubMed