BDBM50149988 CHEMBL3770945
SMILES O=C(Cc1ccccc1)Nc1nnc(OC[C@H]2CCN(C2)c2nnc(NC(=O)Cc3ccccc3)s2)s1
InChI Key InChIKey=MCGCQOMLXYBFEA-UHFFFAOYSA-N
Data  1 IC50
  Tab Delimited (TSV)   2D SDfile   Computed 3D by Vconf -m prep SDfile
Find this compound or compounds like it in BindingDB:
Activity Spreadsheet -- Enzyme Inhibition Constant Data from BindingDB
Found 1 hit for monomerid = 50149988
TargetGlutaminase kidney isoform, mitochondrial(Homo sapiens (Human))
University Of Pittsburgh
Curated by ChEMBL
LigandPNGBDBM50149988(CHEMBL3770945)
Affinity DataIC50:  30nM. Assay description: Inhibition of recombinant HIs-tagged human GAC (residue 72-603 aa) expressed in Escherichia coli after 10 mins using glutamine as substrate
In DepthDetails ArticlePubMed