BDBM50150014 CHEMBL291229::Phosphoric acid mono-{2-((Z)-(R)-octadec-9-enoylamino)-3-[4-(4-propoxy-pyridin-2-ylmethoxy)-phenyl]-propyl} ester
SMILES CCCCCCCC\C=C/CCCCCCCC(=O)N[C@@H](COP(O)(O)=O)Cc1ccc(OCc2cc(OCCC)ccn2)cc1
InChI Key InChIKey=ZLSDCXIMTHAOPK-DAQIJLTHSA-N
Data  2 KI  1 IC50
  Tab Delimited (TSV)   2D SDfile   Computed 3D by Vconf -m prep SDfile
Find this compound or compounds like it in BindingDB:
Activity Spreadsheet -- Enzyme Inhibition Constant Data from BindingDB
Found 3 hits for monomerid = 50150014
TargetLysophosphatidic acid receptor 1(Homo sapiens (Human))
University Of Virginia
Curated by ChEMBL
LigandPNGBDBM50150014(CHEMBL291229 | Phosphoric acid mono-{2-((Z)-(R)-oc...)
Affinity DataKi:  64nM. Assay description: Binding affinity towards Lysophosphatidic acid 1 (LPA1) receptor
In DepthDetails ArticlePubMed
TargetLysophosphatidic acid receptor 3(Homo sapiens (Human))
University Of Virginia
Curated by ChEMBL
LigandPNGBDBM50150014(CHEMBL291229 | Phosphoric acid mono-{2-((Z)-(R)-oc...)
Affinity DataKi:  1.66E+3nM. Assay description: Binding affinity towards Lysophosphatidic acid 3 (LPA3) receptor
In DepthDetails ArticlePubMed
TargetLysophosphatidic acid receptor 1(Homo sapiens (Human))
University Of Virginia
Curated by ChEMBL
LigandPNGBDBM50150014(CHEMBL291229 | Phosphoric acid mono-{2-((Z)-(R)-oc...)
Affinity DataIC50:  141nM. Assay description: Inhibitory concentration against Lysophosphatidic acid 1 (LPA1) receptor
In DepthDetails ArticlePubMed