BDBM50150037 CHEMBL3770701
SMILES Cc1nc2c(c(Cl)c(Cl)cc2n1Cc1ccc(cc1)C#N)[N+]([O-])=O
InChI Key InChIKey=VRZOSCAQSMBSOO-UHFFFAOYSA-N
Data  1 IC50
  Tab Delimited (TSV)   2D SDfile   Computed 3D by Vconf -m prep SDfile
Find this compound or compounds like it in BindingDB:
Activity Spreadsheet -- Enzyme Inhibition Constant Data from BindingDB
Found 1 hit for monomerid = 50150037
TargetdCTP pyrophosphatase 1(Homo sapiens (Human))
Karolinska Institutet
Curated by ChEMBL
LigandPNGBDBM50150037(CHEMBL3770701)
Affinity DataIC50:  165nM. Assay description: Inhibition of human recombinant full length dCTPase expressed in Escherichia coli BL21(DE3)pLysS using dCTP as substrate after 1 hr by HTS-adapted Ma...
In DepthDetails ArticlePubMed