BDBM50150071 CHEMBL3774946
SMILES OC(Cn1ccsc1=N)c1cc2ccccc2o1
InChI Key InChIKey=RBKCVSKQANFBMN-UHFFFAOYSA-N
Data  4 IC50
  Tab Delimited (TSV)   2D SDfile   Computed 3D by Vconf -m prep SDfile
Find this compound or compounds like it in BindingDB:
Activity Spreadsheet -- Enzyme Inhibition Constant Data from BindingDB
Found 4 hits for monomerid = 50150071
TargetIntestinal-type alkaline phosphatase(Bos taurus (Cattle))
Universit£
Curated by ChEMBL
LigandPNGBDBM50150071(CHEMBL3774946)
Affinity DataIC50: >4.00E+5nMpH: 7.8Assay Description:Inhibition of bovine intestinal alkaline phosphatase using para-nitrophenylphosphate as substrate preincubated for 10 mins at pH 10.4 followed by sub...
In DepthDetails ArticlePubMed
TargetAlkaline phosphatase, placental type(Homo sapiens (Human))
Universit£
Curated by ChEMBL
LigandPNGBDBM50150071(CHEMBL3774946)
Affinity DataIC50: >4.00E+5nMpH: 10.4Assay Description:Inhibition of human placental alkaline phosphatase using para-nitrophenylphosphate as substrate preincubated for 10 mins at pH 10.4 followed by subst...
In DepthDetails ArticlePubMed
TargetIntestinal-type alkaline phosphatase(Bos taurus (Cattle))
Universit£
Curated by ChEMBL
LigandPNGBDBM50150071(CHEMBL3774946)
Affinity DataIC50: >4.00E+5nMpH: 7.8Assay Description:Inhibition of bovine intestinal alkaline phosphatase using para-nitrophenylphosphate as substrate preincubated for 10 mins at pH 7.8 followed by subs...
In DepthDetails ArticlePubMed
TargetAlkaline phosphatase, placental type(Homo sapiens (Human))
Universit£
Curated by ChEMBL
LigandPNGBDBM50150071(CHEMBL3774946)
Affinity DataIC50: >4.00E+5nMpH: 7.8Assay Description:Inhibition of human placental alkaline phosphatase using para-nitrophenylphosphate as substrate preincubated for 10 mins at pH 7.8 followed by substr...
In DepthDetails ArticlePubMed