BDBM50150207 3-(2-Fluoro-phenyl)-2-(4-methanesulfonyl-phenyl)-6-methyl-pyran-4-one::CHEMBL126392
SMILES Cc1cc(=O)c(-c2ccccc2F)c(o1)-c1ccc(cc1)S(C)(=O)=O
InChI Key InChIKey=ZGQDYDMRFRTLDT-UHFFFAOYSA-N
Data  3 IC50
  Tab Delimited (TSV)   2D SDfile   Computed 3D by Vconf -m prep SDfile
Find this compound or compounds like it in BindingDB:
Activity Spreadsheet -- Enzyme Inhibition Constant Data from BindingDB
Found 3 hits for monomerid = 50150207
TargetProstaglandin G/H synthase 1(Homo sapiens (Human))
RhôNe-Poulenc Rorer
Curated by ChEMBL
LigandPNGBDBM50150207(3-(2-Fluoro-phenyl)-2-(4-methanesulfonyl-phenyl)-6...)
Affinity DataIC50: >1.00E+5nM. Assay description: Inhibition concentration against cyclooxygenase-1 (COX-1) in human whole blood
In DepthDetails ArticlePubMed
TargetProstaglandin G/H synthase 2(Homo sapiens (Human))
Devi Ahilya Vishwavidyalaya
Curated by ChEMBL
LigandPNGBDBM50150207(3-(2-Fluoro-phenyl)-2-(4-methanesulfonyl-phenyl)-6...)
Affinity DataIC50:  1.53E+3nM. Assay description: Inhibitory concentration for Cyclooxygenase-2 (Prostaglandin G/H synthase 2) in human whole blood
In DepthDetails ArticlePubMed
TargetProstaglandin G/H synthase 2(Homo sapiens (Human))
Devi Ahilya Vishwavidyalaya
Curated by ChEMBL
LigandPNGBDBM50150207(3-(2-Fluoro-phenyl)-2-(4-methanesulfonyl-phenyl)-6...)
Affinity DataIC50:  1.53E+3nM. Assay description: Inhibition concentration against cyclooxygenase-2 (COX-2) in human whole blood
In DepthDetails ArticlePubMed