BDBM50150355 4-[({(S)-[(Benzo[1,3]dioxol-5-ylmethyl)-carbamoyl]-phenyl-methyl}-carbamoyl)-methoxy]-pyridine-2,6-dicarboxylic acid dimethyl ester::CHEMBL359728
SMILES COC(=O)c1cc(OCC(=O)N[C@H](C(=O)NCc2ccc3OCOc3c2)c2ccccc2)cc(n1)C(=O)OC
InChI Key InChIKey=COZZTJVHZWMORD-DEOSSOPVSA-N
Data  1 IC50
  Tab Delimited (TSV)   2D SDfile   Computed 3D by Vconf -m prep SDfile
Find this compound or compounds like it in BindingDB:
Activity Spreadsheet -- Enzyme Inhibition Constant Data from BindingDB
Found 1 hit for monomerid = 50150355
TargetProto-oncogene tyrosine-protein kinase Src(Homo sapiens (Human))
Darmstadt Technical University
Curated by ChEMBL
LigandPNGBDBM50150355(4-[({(S)-[(Benzo[1,3]dioxol-5-ylmethyl)-carbamoyl]...)
Affinity DataIC50:  7.14E+5nM. Assay description: Inhibition of fluorescent (GpYEEI) binding to Src protein tryrosine kinase SH2 domain
In DepthDetails ArticlePubMed