BDBM50150454 CHEMBL3770165
SMILES Cc1cc(C[C@@H](NC(=O)N2CCN(CC2)c2ccc(cc2Cl)S(C)(=O)=O)C(=O)N2CCC(CC2)N2CCCCC2)cc2cn[nH]c12
InChI Key InChIKey=HPLDMLVYRDSJID-GDLZYMKVSA-N
Data  1 IC50
  Tab Delimited (TSV)   2D SDfile   Computed 3D by Vconf -m prep SDfile
Find this compound or compounds like it in BindingDB:
Activity Spreadsheet -- Enzyme Inhibition Constant Data from BindingDB
Found 1 hit for monomerid = 50150454
TargetCalcitonin gene-related peptide 1(Homo sapiens (Human))
Bristol-Myers Squibb Discovery
Curated by ChEMBL
LigandPNGBDBM50150454(CHEMBL3770165)
Affinity DataIC50:  7nM. Assay description: Displacement of [125I]CGRP from alpha CGRP in human SK-N-MC cells after 2 hrs by scintillation counter
In DepthDetails ArticlePubMed