BDBM50150492 2-(5-Carbamimidoyl-2-{4-[1-(1-imino-ethyl)-piperidin-4-yloxy]-phenoxymethyl}-benzoimidazol-1-yl)-N-(1-phenyl-ethyl)-acetamide; dihydrochloride::CHEMBL536723
SMILES CC(NC(=O)Cn1c(COc2ccc(OC3CCN(CC3)C(C)=N)cc2)nc2cc(ccc12)C(N)=N)c1ccccc1
InChI Key InChIKey=BRSITPAOLUGYEZ-UHFFFAOYSA-N
Data  2 IC50
  Tab Delimited (TSV)   2D SDfile   Computed 3D by Vconf -m prep SDfile
Find this compound or compounds like it in BindingDB:
Activity Spreadsheet -- Enzyme Inhibition Constant Data from BindingDB
Found 2 hits for monomerid = 50150492
TargetCoagulation factor X(Homo sapiens (Human))
Central Pharmaceutical Research Institute
Curated by ChEMBL
LigandPNGBDBM50150492(2-(5-Carbamimidoyl-2-{4-[1-(1-imino-ethyl)-piperid...)
Affinity DataIC50:  30nM. Assay description: Inhibitory concentration against human Coagulation factor X
In DepthDetails ArticlePubMed
TargetProthrombin(Homo sapiens (Human))
Central Pharmaceutical Research Institute
Curated by ChEMBL
LigandPNGBDBM50150492(2-(5-Carbamimidoyl-2-{4-[1-(1-imino-ethyl)-piperid...)
Affinity DataIC50: >1.00E+4nM. Assay description: Inhibitory concentration against Coagulation factor II
In DepthDetails ArticlePubMed