BDBM50150705 CHEMBL3770102
SMILES O=C(Cc1ccccc1)Nc1ccc(OC2CCN(CC2)c2ccc(NC(=O)Cc3ccccc3)nn2)nn1
InChI Key InChIKey=IDGBGPKCEIHLHR-UHFFFAOYSA-N
Data  1 IC50
PDB links: 1 PDB ID matches this monomer.
  Tab Delimited (TSV)   2D SDfile   Computed 3D by Vconf -m prep SDfile
Find this compound or compounds like it in BindingDB:
Activity Spreadsheet -- Enzyme Inhibition Constant Data from BindingDB
Found 1 hit for monomerid = 50150705
TargetGlutaminase kidney isoform, mitochondrial(Homo sapiens (Human))
University Of Pittsburgh
Curated by ChEMBL
LigandPNGBDBM50150705(CHEMBL3770102)
Affinity DataIC50:  98nM. Assay description: Inhibition of recombinant HIs-tagged human GAC (residue 72-603 aa) expressed in Escherichia coli after 10 mins using glutamine as substrate