BDBM50150706 2-(2,4-Dichloro-phenoxy)-N-[2-(4-ethyl-piperazin-1-yl)-4-methyl-quinolin-6-yl]-propionamide::CHEMBL184860
SMILES CCN1CCN(CC1)c1cc(C)c2cc(NC(=O)C(C)Oc3ccc(Cl)cc3Cl)ccc2n1
InChI Key InChIKey=WACZZEOIDRYYDD-UHFFFAOYSA-N
Data  1 IC50
  Tab Delimited (TSV)   2D SDfile   Computed 3D by Vconf -m prep SDfile
Find this compound or compounds like it in BindingDB:
Activity Spreadsheet -- Enzyme Inhibition Constant Data from BindingDB
Found 1 hit for monomerid = 50150706
TargetMelanin-concentrating hormone receptor 1(Homo sapiens (Human))
Argenta Discovery
Curated by ChEMBL
LigandPNGBDBM50150706(2-(2,4-Dichloro-phenoxy)-N-[2-(4-ethyl-piperazin-1...)
Affinity DataIC50:  230nM. Assay description: Inhibition of Melanin-concentrating hormone 1 receptor expressed in CHO cells
In DepthDetails ArticlePubMed