BDBM50150826 CHEMBL1734009
SMILES Cn1c2ccc(NS(=O)(=O)c3ccccc3)cc2n(C)c1=O
InChI Key InChIKey=DKIUWQHZRMYIIV-UHFFFAOYSA-N
Data  1 IC50
  Tab Delimited (TSV)   2D SDfile   Computed 3D by Vconf -m prep SDfile
Find this compound or compounds like it in BindingDB:
Activity Spreadsheet -- Enzyme Inhibition Constant Data from BindingDB
Found 1 hit for monomerid = 50150826
TargetTranscription intermediary factor 1-alpha(Homo sapiens (Human))
The University Of Texas M.D. Anderson Cancer Center
Curated by ChEMBL
LigandPNGBDBM50150826(CHEMBL1734009)
Affinity DataIC50:  2.30E+4nM. Assay description: Inhibition of KDM5C (unknown origin) using biotin-H3K4me3 as substrate preincubated for 15 mins followed by substrate addition measured after 20 mins...
In DepthDetails ArticlePubMed