BDBM50150861 2-[2-(Adamantan-2-ylamino)-acetyl]-3,4-dihydro-2H-pyrazole-3-carbonitrile::CHEMBL183728
SMILES O=C(CNC1C2CC3CC(C2)CC1C3)N1N=CCC1C#N
InChI Key InChIKey=ODKLDWQDOZXVCW-UHFFFAOYSA-N
Data  1 IC50
  Tab Delimited (TSV)   2D SDfile   Computed 3D by Vconf -m prep SDfile
Find this compound or compounds like it in BindingDB:
Activity Spreadsheet -- Enzyme Inhibition Constant Data from BindingDB
Found 1 hit for monomerid = 50150861
TargetDipeptidyl peptidase 4(Rattus norvegicus (rat))
Korea Research Institute Of Chemical Technology
Curated by ChEMBL
LigandPNGBDBM50150861(2-[2-(Adamantan-2-ylamino)-acetyl]-3,4-dihydro-2H-...)
Affinity DataIC50:  3.20E+3nM. Assay description: Inhibitory concentration against rat dipeptidyl peptidase IV
In DepthDetails ArticlePubMed