BDBM50150919 CHEMBL3775048
SMILES CC(=O)c1c(C)[nH]c(C(=O)Nc2cc(ccc2C)C(O)=O)c1C
InChI Key InChIKey=ZLVLXUCLUJDEKJ-UHFFFAOYSA-N
Data  1 IC50
  Tab Delimited (TSV)   2D SDfile   Computed 3D by Vconf -m prep SDfile
Find this compound or compounds like it in BindingDB:
Activity Spreadsheet -- Enzyme Inhibition Constant Data from BindingDB
Found 1 hit for monomerid = 50150919
TargetCREB-binding protein(Homo sapiens (Human))
University Of Z£Rich
Curated by ChEMBL
LigandPNGBDBM50150919(CHEMBL3775048)
Affinity DataIC50: >1.00E+4nM. Assay description: Inhibition of human N-terminal His-tagged KDM4A (1 to 359 residues) expressed in Escherichia coli using biotin-H3K9me3 as substrate preincubated for ...
In DepthDetails ArticlePubMed