BDBM50150994 (E)-3-{3-[2-((S)-4,4-Difluoro-2-{[(2S,4S)-1-((S)-2-isobutoxycarbonylamino-3-methyl-butyryl)-4-phenyl-pyrrolidine-2-carbonyl]-amino}-butyrylamino)-ethyl]-2-fluoro-phenyl}-acrylic acid::CHEMBL364325
SMILES CC(C)COC(=O)N[C@@H](C(C)C)C(=O)N1C[C@@H](C[C@H]1C(=O)N[C@@H](CC(F)F)C(=O)NCCc1cccc(C=CC(O)=O)c1F)c1ccccc1
InChI Key InChIKey=NUTHSVHYGJKNQX-SRGLEEMKSA-N
Data  1 KI
  Tab Delimited (TSV)   2D SDfile   Computed 3D by Vconf -m prep SDfile
Find this compound or compounds like it in BindingDB:
Activity Spreadsheet -- Enzyme Inhibition Constant Data from BindingDB
Found 1 hit for monomerid = 50150994
TargetGenome polyprotein/Non-structural protein 4A(Hepatitis C virus)
Merck Research Laboratories
Curated by ChEMBL
LigandPNGBDBM50150994((E)-3-{3-[2-((S)-4,4-Difluoro-2-{[(2S,4S)-1-((S)-2...)
Affinity DataKi:  400nM. Assay description: Inhibitory activity against Hepatitis C virus Non structural protein 3 serine protease/Non structural protein 4A serine protease
In DepthDetails ArticlePubMed