BDBM50150998 ((4-Methoxy-phenoxycarbonyl)-{4-[2-(5-methyl-2-phenyl-oxazol-4-yl)-ethoxy]-benzyl}-amino)-acetic acid::2-[(4-methoxyphenoxycarbonyl)({3-[2-(5-methyl-2-phenyl-1,3-oxazol-4-yl)ethoxy]phenyl}methyl)amino]acetic acid::2-[(4-methoxyphenoxycarbonyl)({4-[2-(5-methyl-2-phenyl-1,3-oxazol-4-yl)ethoxy]phenyl}methyl)amino]acetic acid::CHEMBL186179::MURAGLITAZAR::MURAGLITAZAR CHLORIDE::[C14]-2-((4-methoxyphenoxy)carbonyl)acetic acid
SMILES COc1ccc(OC(=O)N(CC(O)=O)Cc2ccc(OCCc3nc(oc3C)-c3ccccc3)cc2)cc1
InChI Key InChIKey=IRLWJILLXJGJTD-UHFFFAOYSA-N
Data  8 IC50  19 EC50
  Tab Delimited (TSV)   2D SDfile   Computed 3D by Vconf -m prep SDfile
Find this compound or compounds like it in BindingDB:
Activity Spreadsheet -- Enzyme Inhibition Constant Data from BindingDB
Found 27 hits for monomerid = 50150998
TargetPeroxisome proliferator-activated receptor alpha(Homo sapiens (Human))
Glaxosmithkline
Curated by ChEMBL
LigandPNGBDBM50150998(((4-Methoxy-phenoxycarbonyl)-{4-[2-(5-methyl-2-phe...)
Affinity DataEC50:  240nM. Assay description: Effective concentration against human peroxisome proliferator activated receptor alpha in Gal4 transactivation assay
In DepthDetails ArticlePubMed
TargetPeroxisome proliferator-activated receptor gamma(Homo sapiens (Human))
Sptanis Pharmachem Consulting
Curated by ChEMBL
LigandPNGBDBM50150998(((4-Methoxy-phenoxycarbonyl)-{4-[2-(5-methyl-2-phe...)
Affinity DataIC50:  120nM. Assay description: Competitive displacement of fluorescently labelled PPAR tracer ligand from GST-tagged human PPARgamma ligand binding domain after 1 hr in dark by TR-...
In DepthDetails ArticlePubMed
TargetPeroxisome proliferator-activated receptor alpha(Homo sapiens (Human))
Glaxosmithkline
Curated by ChEMBL
LigandPNGBDBM50150998(((4-Methoxy-phenoxycarbonyl)-{4-[2-(5-methyl-2-phe...)
Affinity DataEC50:  1.41E+3nM. Assay description: Agonist activity at GAL4 tagged human PPARalpha ligand binding domain expressed in HEK293 cells by luciferase reporter gene assay
In DepthDetails ArticlePubMed
TargetPeroxisome proliferator-activated receptor gamma(Homo sapiens (Human))
Sptanis Pharmachem Consulting
Curated by ChEMBL
LigandPNGBDBM50150998(((4-Methoxy-phenoxycarbonyl)-{4-[2-(5-methyl-2-phe...)
Affinity DataEC50:  35nM. Assay description: Agonist activity at GAL4 tagged human PPARgamma ligand binding domain expressed in HEK293 cells by luciferase reporter gene assay
In DepthDetails ArticlePubMed
TargetPeroxisome proliferator-activated receptor alpha(Homo sapiens (Human))
Glaxosmithkline
Curated by ChEMBL
LigandPNGBDBM50150998(((4-Methoxy-phenoxycarbonyl)-{4-[2-(5-methyl-2-phe...)
Affinity DataIC50:  250nM. Assay description: Inhibition of human Peroxisome proliferator activated receptor alpha
In DepthDetails ArticlePubMed
TargetPeroxisome proliferator-activated receptor alpha(Homo sapiens (Human))
Glaxosmithkline
Curated by ChEMBL
LigandPNGBDBM50150998(((4-Methoxy-phenoxycarbonyl)-{4-[2-(5-methyl-2-phe...)
Affinity DataEC50:  320nM. Assay description: Effective concentration against human Peroxisome proliferator activated receptor alpha
In DepthDetails ArticlePubMed
TargetPeroxisome proliferator-activated receptor gamma(Homo sapiens (Human))
Sptanis Pharmachem Consulting
Curated by ChEMBL
LigandPNGBDBM50150998(((4-Methoxy-phenoxycarbonyl)-{4-[2-(5-methyl-2-phe...)
Affinity DataIC50:  190nM. Assay description: Inhibition of human Peroxisome proliferator activated receptor gamma
In DepthDetails ArticlePubMed
TargetPeroxisome proliferator-activated receptor gamma(Homo sapiens (Human))
Sptanis Pharmachem Consulting
Curated by ChEMBL
LigandPNGBDBM50150998(((4-Methoxy-phenoxycarbonyl)-{4-[2-(5-methyl-2-phe...)
Affinity DataEC50:  110nM. Assay description: Effective concentration against human Peroxisome proliferator activated receptor gamma
In DepthDetails ArticlePubMed
TargetPeroxisome proliferator-activated receptor alpha(Homo sapiens (Human))
Glaxosmithkline
Curated by ChEMBL
LigandPNGBDBM50150998(((4-Methoxy-phenoxycarbonyl)-{4-[2-(5-methyl-2-phe...)
Affinity DataEC50:  4.11E+3nM. Assay description: Agonist activity at human PPARalpha expressed in african green monkey CV-1 by cotransfected with GAL4 by by dual-glo luciferase reporter gene assay
In DepthDetails ArticlePubMed
TargetPeroxisome proliferator-activated receptor gamma(Homo sapiens (Human))
Sptanis Pharmachem Consulting
Curated by ChEMBL
LigandPNGBDBM50150998(((4-Methoxy-phenoxycarbonyl)-{4-[2-(5-methyl-2-phe...)
Affinity DataEC50:  153nM. Assay description: Agonist activity at human PPARgamma expressed in african green monkey CV-1 cotransfected with GAL4 by by dual-glo luciferase reporter gene assay
In DepthDetails ArticlePubMed
TargetPeroxisome proliferator-activated receptor gamma(Homo sapiens (Human))
Sptanis Pharmachem Consulting
Curated by ChEMBL
LigandPNGBDBM50150998(((4-Methoxy-phenoxycarbonyl)-{4-[2-(5-methyl-2-phe...)
Affinity DataEC50:  35nM. Assay description: Binding affinity to PPARgamma (unknown origin) by fluorescence polarization assay
In DepthDetails ArticlePubMed
TargetPeroxisome proliferator-activated receptor alpha(Homo sapiens (Human))
Glaxosmithkline
Curated by ChEMBL
LigandPNGBDBM50150998(((4-Methoxy-phenoxycarbonyl)-{4-[2-(5-methyl-2-phe...)
Affinity DataEC50:  1.41E+3nM. Assay description: Binding affinity to PPARalpha (unknown origin) by fluorescence polarization assay
In DepthDetails ArticlePubMed
TargetPeroxisome proliferator-activated receptor alpha(Homo sapiens (Human))
Glaxosmithkline
Curated by ChEMBL
LigandPNGBDBM50150998(((4-Methoxy-phenoxycarbonyl)-{4-[2-(5-methyl-2-phe...)
Affinity DataIC50:  190nM. Assay description: Binding affinity at human PPARalpha by fluorescence polarization
In DepthDetails ArticlePubMed
TargetPeroxisome proliferator-activated receptor gamma(Homo sapiens (Human))
Sptanis Pharmachem Consulting
Curated by ChEMBL
LigandPNGBDBM50150998(((4-Methoxy-phenoxycarbonyl)-{4-[2-(5-methyl-2-phe...)
Affinity DataIC50:  250nM. Assay description: Binding affinity at human PPARalpha by fluorescence polarization
In DepthDetails ArticlePubMed
TargetPeroxisome proliferator-activated receptor gamma(Homo sapiens (Human))
Sptanis Pharmachem Consulting
Curated by ChEMBL
LigandPNGBDBM50150998(((4-Methoxy-phenoxycarbonyl)-{4-[2-(5-methyl-2-phe...)
Affinity DataEC50:  1.41E+3nM. Assay description: Agonist activity at human PPARalpha expressed in HEK293 cells assessed as luciferase activity by GAL4 transactivation assay
In DepthDetails ArticlePubMed
TargetPeroxisome proliferator-activated receptor alpha(Homo sapiens (Human))
Glaxosmithkline
Curated by ChEMBL
LigandPNGBDBM50150998(((4-Methoxy-phenoxycarbonyl)-{4-[2-(5-methyl-2-phe...)
Affinity DataEC50:  40nM. Assay description: Agonist activity at human PPARgamma expressed in HEK293 cells assessed as luciferase activity by GAL4 transactivation assay
In DepthDetails ArticlePubMed
TargetPeroxisome proliferator-activated receptor alpha(Homo sapiens (Human))
Glaxosmithkline
Curated by ChEMBL
LigandPNGBDBM50150998(((4-Methoxy-phenoxycarbonyl)-{4-[2-(5-methyl-2-phe...)
Affinity DataEC50:  150nM. Assay description: Agonist activity at human PPARalpha transactivation expressed in human HePG2 cells
In DepthDetails ArticlePubMed
TargetPeroxisome proliferator-activated receptor gamma(Homo sapiens (Human))
Sptanis Pharmachem Consulting
Curated by ChEMBL
LigandPNGBDBM50150998(((4-Methoxy-phenoxycarbonyl)-{4-[2-(5-methyl-2-phe...)
Affinity DataEC50:  90nM. Assay description: Agonist activity at human PPARgamma transactivation expressed in human HePG2 cells
In DepthDetails ArticlePubMed
TargetPeroxisome proliferator-activated receptor alpha(Homo sapiens (Human))
Glaxosmithkline
Curated by ChEMBL
LigandPNGBDBM50150998(((4-Methoxy-phenoxycarbonyl)-{4-[2-(5-methyl-2-phe...)
Affinity DataEC50:  35nM. Assay description: Agonist activity at PPAR alpha in human HEK cells by transactivation assay
In DepthDetails ArticlePubMed
TargetPeroxisome proliferator-activated receptor gamma(Homo sapiens (Human))
Sptanis Pharmachem Consulting
Curated by ChEMBL
LigandPNGBDBM50150998(((4-Methoxy-phenoxycarbonyl)-{4-[2-(5-methyl-2-phe...)
Affinity DataIC50:  247nM. Assay description: Binding affinity at PPAR gamma receptor
In DepthDetails ArticlePubMed
TargetPeroxisome proliferator-activated receptor gamma(Homo sapiens (Human))
Sptanis Pharmachem Consulting
Curated by ChEMBL
LigandPNGBDBM50150998(((4-Methoxy-phenoxycarbonyl)-{4-[2-(5-methyl-2-phe...)
Affinity DataIC50:  1.41E+3nM. Assay description: Agonist activity at PPAR gamma in human HEK cells by transactivation assay
In DepthDetails ArticlePubMed
TargetPeroxisome proliferator-activated receptor alpha(Homo sapiens (Human))
Glaxosmithkline
Curated by ChEMBL
LigandPNGBDBM50150998(((4-Methoxy-phenoxycarbonyl)-{4-[2-(5-methyl-2-phe...)
Affinity DataIC50:  188nM. Assay description: Binding affinity at PPAR alpha receptor
In DepthDetails ArticlePubMed
TargetPeroxisome proliferator-activated receptor gamma(Homo sapiens (Human))
Sptanis Pharmachem Consulting
Curated by ChEMBL
LigandPNGBDBM50150998(((4-Methoxy-phenoxycarbonyl)-{4-[2-(5-methyl-2-phe...)
Affinity DataEC50:  100nM. Assay description: Agonist activity at GAL4-fused PPARgamma assessed as transcriptional activity by cell based assay
In DepthDetails ArticlePubMed
TargetPeroxisome proliferator-activated receptor alpha(Homo sapiens (Human))
Glaxosmithkline
Curated by ChEMBL
LigandPNGBDBM50150998(((4-Methoxy-phenoxycarbonyl)-{4-[2-(5-methyl-2-phe...)
Affinity DataEC50:  300nM. Assay description: Agonist activity at GAL4-fused PPARalpha assessed as transcriptional activity by cell based assay
In DepthDetails ArticlePubMed
TargetPeroxisome proliferator-activated receptor alpha(Homo sapiens (Human))
Glaxosmithkline
Curated by ChEMBL
LigandPNGBDBM50150998(((4-Methoxy-phenoxycarbonyl)-{4-[2-(5-methyl-2-phe...)
Affinity DataEC50:  595nM. Assay description: Transactivation of human Gal4-fused PPARalpha LBD expressed in African green monkey COS7 cells after 24 hrs by luciferase reporter gene assay
In DepthDetails ArticlePubMed
TargetPeroxisome proliferator-activated receptor gamma(Homo sapiens (Human))
Sptanis Pharmachem Consulting
Curated by ChEMBL
LigandPNGBDBM50150998(((4-Methoxy-phenoxycarbonyl)-{4-[2-(5-methyl-2-phe...)
Affinity DataEC50:  3nM. Assay description: Transactivation of human Gal4-fused PPARgamma LBD expressed in African green monkey COS7 cells after 24 hrs by luciferase reporter gene assay
In DepthDetails ArticlePubMed
TargetPeroxisome proliferator-activated receptor gamma(Homo sapiens (Human))
Sptanis Pharmachem Consulting
Curated by ChEMBL
LigandPNGBDBM50150998(((4-Methoxy-phenoxycarbonyl)-{4-[2-(5-methyl-2-phe...)
Affinity DataEC50:  120nM. Assay description: Effective concentration against human peroxisome proliferator activated receptor gamma in Gal4 transactivation assay
In DepthDetails ArticlePubMed