BDBM50151169 5-Phenyl-1H-pyrrole-2-carboxylic acid [1-cyclohexylcarbamoyl-2-(5-methyl-furan-2-yl)-ethyl]-(3-diethylamino-propyl)-amide::CHEMBL186647
SMILES CCN(CC)CCCN(C(Cc1ccc(C)o1)C(=O)NC1CCCCC1)C(=O)c1ccc([nH]1)-c1ccccc1
InChI Key InChIKey=IRQZEYBHGZCGEZ-UHFFFAOYSA-N
Data  1 KI
  Tab Delimited (TSV)   2D SDfile   Computed 3D by Vconf -m prep SDfile
Find this compound or compounds like it in BindingDB:
Activity Spreadsheet -- Enzyme Inhibition Constant Data from BindingDB
Found 1 hit for monomerid = 50151169
TargetGrowth hormone secretagogue receptor type 1(Homo sapiens (Human))
Institute For Life Science Research
Curated by ChEMBL
LigandPNGBDBM50151169(5-Phenyl-1H-pyrrole-2-carboxylic acid [1-cyclohexy...)
Affinity DataKi:  1.17E+3nM. Assay description: Binding affinity for human growth hormone secretagogue receptor was determined using [125I]-ghrelin
In DepthDetails ArticlePubMed