BDBM50151967 5-Cyclopentyloxy-3-{4-[4-(4-methoxy-phenyl)-piperazin-1-yl]-butyl}-1H-indole::CHEMBL364341
SMILES COc1ccc(cc1)N1CCN(CCCCc2c[nH]c3ccc(OC4CCCC4)cc23)CC1
InChI Key InChIKey=GOHAIWYNEPLTLZ-UHFFFAOYSA-N
Data  2 IC50
  Tab Delimited (TSV)   2D SDfile   Computed 3D by Vconf -m prep SDfile
Find this compound or compounds like it in BindingDB:
Activity Spreadsheet -- Enzyme Inhibition Constant Data from BindingDB
Found 2 hits for monomerid = 50151967
Target5-hydroxytryptamine receptor 1A(Rattus norvegicus (rat))
Merck
Curated by ChEMBL
LigandPNGBDBM50151967(5-Cyclopentyloxy-3-{4-[4-(4-methoxy-phenyl)-pipera...)
Affinity DataIC50:  90nM. Assay description: Inhibition of 8-OH DPAT bindign to rat hydroxytryptamine 1A receptor expressed in CHO cells
In DepthDetails ArticlePubMed
TargetD(2) dopamine receptor(Rattus norvegicus (rat))
Merck
Curated by ChEMBL
LigandPNGBDBM50151967(5-Cyclopentyloxy-3-{4-[4-(4-methoxy-phenyl)-pipera...)
Affinity DataIC50: >100nM. Assay description: Displacement of [3H]-spiperone from dopamine D2 receptor of rat striatal membranes
In DepthDetails ArticlePubMed