BDBM50151974 3-{4-[4-(4-Methoxy-phenyl)-piperazin-1-yl]-butyl}-1H-indole-5-carboxylic acid methyl ester::CHEMBL360415
SMILES COC(=O)c1ccc2[nH]cc(CCCCN3CCN(CC3)c3ccc(OC)cc3)c2c1
InChI Key InChIKey=LIPBRTUWGKEQNE-UHFFFAOYSA-N
Data  2 IC50
  Tab Delimited (TSV)   2D SDfile   Computed 3D by Vconf -m prep SDfile
Find this compound or compounds like it in BindingDB:
Activity Spreadsheet -- Enzyme Inhibition Constant Data from BindingDB
Found 2 hits for monomerid = 50151974
TargetD(2) dopamine receptor(Rattus norvegicus (rat))
Merck
Curated by ChEMBL
LigandPNGBDBM50151974(3-{4-[4-(4-Methoxy-phenyl)-piperazin-1-yl]-butyl}-...)
Affinity DataIC50: >100nM. Assay description: Displacement of [3H]-spiperone from dopamine D2 receptor of rat striatal membranes
In DepthDetails ArticlePubMed
Target5-hydroxytryptamine receptor 1A(Rattus norvegicus (rat))
Merck
Curated by ChEMBL
LigandPNGBDBM50151974(3-{4-[4-(4-Methoxy-phenyl)-piperazin-1-yl]-butyl}-...)
Affinity DataIC50:  8nM. Assay description: Inhibition of 8-OH DPAT bindign to rat hydroxytryptamine 1A receptor expressed in CHO cells
In DepthDetails ArticlePubMed