BDBM50152044 3-(2,4-Dichloro-phenyl)-8-ethyl-7-(1-methoxymethyl-butyl)-1-methyl-1,2,3,7-tetrahydro-purin-6-one::CHEMBL362413
SMILES CCCC(COC)n1c(CC)nc2N(CN(C)C(=O)c12)c1ccc(Cl)cc1Cl
InChI Key InChIKey=WUGHUPVRXDBFKH-UHFFFAOYSA-N
Data  1 IC50
  Tab Delimited (TSV)   2D SDfile   Computed 3D by Vconf -m prep SDfile
Find this compound or compounds like it in BindingDB:
Activity Spreadsheet -- Enzyme Inhibition Constant Data from BindingDB
Found 1 hit for monomerid = 50152044
TargetCorticotropin-releasing factor receptor 1(Rattus norvegicus (rat))
Pharmaceutical Research Institute
Curated by ChEMBL
LigandPNGBDBM50152044(3-(2,4-Dichloro-phenyl)-8-ethyl-7-(1-methoxymethyl...)
Affinity DataIC50:  43nM. Assay description: Inhibition of [125I]- Ovine CRF binding to rat frontal cortex corticotropin releasing factor 1 receptor
In DepthDetails ArticlePubMed