BDBM50152374 4-[6-Methoxy-7-(3-piperidin-1-yl-propoxy)-quinazolin-4-yl]-piperazine-1-carbothioic acid (4-pyridin-2-yl-phenyl)-amide::CHEMBL184699
SMILES COc1cc2c(ncnc2cc1OCCCN1CCCCC1)N1CCN(CC1)C(=S)Nc1ccc(cc1)-c1ccccn1
InChI Key InChIKey=INSHWQJRTYJGTH-UHFFFAOYSA-N
Data  2 IC50
  Tab Delimited (TSV)   2D SDfile   Computed 3D by Vconf -m prep SDfile
Find this compound or compounds like it in BindingDB:
Activity Spreadsheet -- Enzyme Inhibition Constant Data from BindingDB
Found 2 hits for monomerid = 50152374
TargetPlatelet-derived growth factor receptor beta(Homo sapiens (Human))
In Vivo Sciences Millennium Pharmaceuticals
Curated by ChEMBL
LigandPNGBDBM50152374(4-[6-Methoxy-7-(3-piperidin-1-yl-propoxy)-quinazol...)
Affinity DataIC50:  100nM. Assay description: In vitro inhibition of Platelet derived growth factor receptor beta autophosphorylation in MG-63 cells with 45% human plasma
In DepthDetails ArticlePubMed
TargetPlatelet-derived growth factor receptor beta(Homo sapiens (Human))
In Vivo Sciences Millennium Pharmaceuticals
Curated by ChEMBL
LigandPNGBDBM50152374(4-[6-Methoxy-7-(3-piperidin-1-yl-propoxy)-quinazol...)
Affinity DataIC50:  220nM. Assay description: In vitro inhibition of Platelet derived growth factor receptor beta autophosphorylation in MG-63 cells without plasma
In DepthDetails ArticlePubMed