BDBM50152587 CHEMBL3780052
SMILES COc1ccc(Cc2nnc(Nc3cccc(OC)c3)c3ccccc23)cc1
InChI Key InChIKey=OYLYGJJIFNWAKJ-UHFFFAOYSA-N
Data  1 IC50
  Tab Delimited (TSV)   2D SDfile   Computed 3D by Vconf -m prep SDfile
Find this compound or compounds like it in BindingDB:
Activity Spreadsheet -- Enzyme Inhibition Constant Data from BindingDB
Found 1 hit for monomerid = 50152587
TargetVascular endothelial growth factor receptor 2(Homo sapiens (Human))
Egyptian Russian University
Curated by ChEMBL
LigandPNGBDBM50152587(CHEMBL3780052)
Affinity DataIC50:  754nM. Assay description: Inhibition of recombinant human VEGFR-2 expressed in Spodoptera frugiperda cells after 5 mins by using biotinylated poly-GluTyr (4:1) as substrate by...
In DepthDetails ArticlePubMed