BDBM50153220 2-Methoxy-4-[3-(3-phenylamino-phenyl)-ureido]-N-(3-piperidin-1-yl-propyl)-benzamide::CHEMBL184438
SMILES COc1cc(NC(=O)Nc2cccc(Nc3ccccc3)c2)ccc1C(=O)NCCCN1CCCCC1
InChI Key InChIKey=NTZAIBPEXMVHAW-UHFFFAOYSA-N
Data  3 IC50
  Tab Delimited (TSV)   2D SDfile   Computed 3D by Vconf -m prep SDfile
Find this compound or compounds like it in BindingDB:
Activity Spreadsheet -- Enzyme Inhibition Constant Data from BindingDB
Found 3 hits for monomerid = 50153220
TargetMelanin-concentrating hormone receptor 2(Homo sapiens (Human))
7Tm Pharma
Curated by ChEMBL
LigandPNGBDBM50153220(2-Methoxy-4-[3-(3-phenylamino-phenyl)-ureido]-N-(3...)
Affinity DataIC50:  1.00E+4nM. Assay description: Binding affinity against human Melanin-concentrating hormone receptor 2 stably transfected CHO cells was determined using [125I]-MCH as radioligand
In DepthDetails ArticlePubMed
TargetMelanin-concentrating hormone receptor 1(Homo sapiens (Human))
7Tm Pharma
Curated by ChEMBL
LigandPNGBDBM50153220(2-Methoxy-4-[3-(3-phenylamino-phenyl)-ureido]-N-(3...)
Affinity DataIC50:  8.10nM. Assay description: Binding affinity against human Melanin-concentrating hormone receptor 1 stably transfected CHO cells was determined using [125I]-MCH as radioligand
In DepthDetails ArticlePubMed
TargetMelanin-concentrating hormone receptor 1(Homo sapiens (Human))
7Tm Pharma
Curated by ChEMBL
LigandPNGBDBM50153220(2-Methoxy-4-[3-(3-phenylamino-phenyl)-ureido]-N-(3...)
Affinity DataIC50:  20nM. Assay description: Antagonistic activity against human Melanin-concentrating hormone receptor 1 stably transfected CHO cells was determined using IP3 assay
In DepthDetails ArticlePubMed