BDBM50153357 CHEMBL3775430
SMILES CCCCCCNC(=O)Oc1cccc(c1)-c1ccc(cc1[N+]([O-])=O)C(C)C(O)=O
InChI Key InChIKey=ICRWYBVAQXMORK-UHFFFAOYSA-N
Data  3 IC50
  Tab Delimited (TSV)   2D SDfile   Computed 3D by Vconf -m prep SDfile
Find this compound or compounds like it in BindingDB:
Activity Spreadsheet -- Enzyme Inhibition Constant Data from BindingDB
Found 3 hits for monomerid = 50153357
TargetProstaglandin G/H synthase 2(Homo sapiens (Human))
Fondazione Istituto Italiano Di Tecnologia
Curated by ChEMBL
LigandPNGBDBM50153357(CHEMBL3775430)
Affinity DataIC50:  930nM. Assay description: Inhibition of recombinant human COX2 assessed as production of PGF2-alpha preincubated with compound followed by the addition of 5 uM arachidonic aci...
In DepthDetails ArticlePubMed
TargetProstaglandin G/H synthase 1(Ovis aries (Sheep))
Fondazione Istituto Italiano Di Tecnologia
Curated by ChEMBL
LigandPNGBDBM50153357(CHEMBL3775430)
Affinity DataIC50:  130nM. Assay description: Inhibition of ovine COX1 assessed as production of PGF2-alpha preincubated with compound followed by the addition of 5 uM arachidonic acid as substra...
In DepthDetails ArticlePubMed
TargetFatty-acid amide hydrolase 1 [30-579](Rattus norvegicus (rat))
Fondazione Istituto Italiano Di Tecnologia
Curated by ChEMBL
LigandPNGBDBM50153357(CHEMBL3775430)
Affinity DataIC50:  9nM. Assay description: Inhibition of FAAH in Sprague-Dawley rat brain homogenates preincubated for 10 mins followed by addition of substrate measured after 30 mins by liqui...
In DepthDetails ArticlePubMed