BDBM50153493 CHEMBL3775707
SMILES CCCCC(NC(=O)[C@H](CCC(O)=O)NC(=O)[C@H](CC(C)C)NC(=O)[C@@H](NC(=O)[C@H](CCC(O)=O)NC(=O)[C@H](CCCNC(N)=N)NC(=O)[C@H](CC(C)C)NC(=O)[C@H](CC(C)C)NC(=O)[C@H](Cc1cnc[nH]1)NC(=O)[C@@H](Cc1ccccc1)NC(=O)[C@@H](NC(=O)[C@H](CC(C)C)NC(=O)[C@H](CC(O)=O)NC(C)=O)[C@@H](C)O)C(C)C)C(=O)N[C@@H](C)C(=O)N[C@@H](CCCNC(N)=N)C(=O)N[C@@H](C)C(=O)N[C@@H](CCC(O)=O)C(=O)N[C@@H](CCC(N)=O)C(=O)NC(C)(CC(C)C)C(=O)N[C@@H](C)C(=O)N[C@@H](CCC(N)=O)C(=O)NC1CCSSCCC(NC(=O)[C@@H](Cc2ccc(NC(N)=O)cc2)NC(=O)C(Cc2ccc(NC(=O)[C@@H]3CC(=O)NC(=O)N3)cc2)NC1=O)C(=O)N[C@@H](CC(N)=O)C(=O)N[C@@H](CCCNC(N)=N)C(=O)N[C@@H](CCCCN)C(=O)N[C@@H](CC(C)C)C(=O)NC(CCCC)C(=O)N[C@@H](CCC(O)=O)C(=O)NC(C)(CC(C)C)C(=O)N[C@@H]([C@@H](C)CC)C(N)=O
InChI Key InChIKey=HJWZTTOXMPJREB-FZJVLVEJSA-N
Data  2 KI
  Tab Delimited (TSV)   2D SDfile   Computed 3D by Vconf -m prep SDfile
Find this compound or compounds like it in BindingDB:
Activity Spreadsheet -- Enzyme Inhibition Constant Data from BindingDB
Found 2 hits for monomerid = 50153493
TargetCorticotropin-releasing factor receptor 2(Mus musculus)
Salk Institute
Curated by ChEMBL
LigandPNGBDBM50153493(CHEMBL3775707)
Affinity DataKi:  41nM. Assay description: Displacement of [125ITyr0-Glu1,Nle17]-PS-Svg in mouse CRF-R2 beta expressed in COS-M6 cells after 90 mins by gamma counting assay
In DepthDetails ArticlePubMed
TargetCorticotropin-releasing factor receptor 1(Homo sapiens (Human))
Salk Institute
Curated by ChEMBL
LigandPNGBDBM50153493(CHEMBL3775707)
Affinity DataKi:  49nM. Assay description: Displacement of [125ITyr0-Glu1,Nle17]-PS-Svg in human CRF-R1 expressed in COS-M6 cells after 90 mins by gamma counting assay
In DepthDetails ArticlePubMed