BDBM50153527 (S)-2-{(S)-2-[3-({2-[(S)-2-Amino-3-(4-hydroxy-phenyl)-propionylamino]-acetylamino}-methyl)-ureido]-3-phenyl-propionylamino}-4-methyl-pentanoic acid::CHEMBL425715
SMILES CC(C)C[C@H](NC(=O)[C@H](Cc1ccccc1)NC(=O)NCNC(=O)CNC(=O)[C@@H](N)Cc1ccc(O)cc1)C(O)=O
InChI Key InChIKey=LTXDLCZJDGRLPM-VABKMULXSA-N
Data  1 IC50
  Tab Delimited (TSV)   2D SDfile   Computed 3D by Vconf -m prep SDfile
Find this compound or compounds like it in BindingDB:
Activity Spreadsheet -- Enzyme Inhibition Constant Data from BindingDB
Found 1 hit for monomerid = 50153527
TargetAngiotensin-converting enzyme(Sus scrofa)
Purdue University
Curated by ChEMBL
LigandPNGBDBM50153527((S)-2-{(S)-2-[3-({2-[(S)-2-Amino-3-(4-hydroxy-phen...)
Affinity DataIC50:  8.80E+5nM. Assay description: Inhibitory concentration against porcine kidney angiotensin converting enzyme cleavage of hippurylhistidylleucine (HHL)
In DepthDetails ArticlePubMed