BDBM50153894 CHEMBL3774935
SMILES COc1cc2ncnc(N(C)c3cccc(O)c3)c2cc1OC
InChI Key InChIKey=QYNCZDLVMQIFGR-UHFFFAOYSA-N
Data  4 IC50
  Tab Delimited (TSV)   2D SDfile   Computed 3D by Vconf -m prep SDfile
Find this compound or compounds like it in BindingDB:
Activity Spreadsheet -- Enzyme Inhibition Constant Data from BindingDB
Found 4 hits for monomerid = 50153894
TargetProto-oncogene tyrosine-protein kinase receptor Ret(Homo sapiens (Human))
University Of Manchester
Curated by ChEMBL
LigandPNGBDBM50153894(CHEMBL3774935)
Affinity DataIC50:  210nM. Assay description: Inhibition of human RET cytoplasmic domain (658 to 1114 residues) expressed in baculovirus system preincubated for 15 mins followed by substrate addi...
In DepthDetails ArticlePubMed
TargetVascular endothelial growth factor receptor 2(Homo sapiens (Human))
University Of Manchester
Curated by ChEMBL
LigandPNGBDBM50153894(CHEMBL3774935)
Affinity DataIC50: >1.00E+4nM. Assay description: Inhibition of KDR (unknown origin) expressed in mouse BA/F3 cells assessed as reduction in cell viability after 48 hrs by Cell titre glo-based lumine...
In DepthDetails ArticlePubMed
TargetKinesin-1 heavy chain/Proto-oncogene tyrosine-protein kinase receptor Ret(Homo sapiens (Human))
University Of Manchester
Curated by ChEMBL
LigandPNGBDBM50153894(CHEMBL3774935)
Affinity DataIC50:  7.20E+3nM. Assay description: Inhibition of KIF5B/RET (unknown origin) expressed in mouse BA/F3 cells assessed as reduction in cell viability after 48 hrs by Cell titre glo-based ...
In DepthDetails ArticlePubMed
TargetVascular endothelial growth factor receptor 2(Homo sapiens (Human))
University Of Manchester
Curated by ChEMBL
LigandPNGBDBM50153894(CHEMBL3774935)
Affinity DataIC50:  4.20E+3nM. Assay description: Inhibition of recombinant His-tagged human KDR expressed in insect Sf21 cells preincubated for 15 mins followed by substrate addition measured after ...
In DepthDetails ArticlePubMed