BDBM50153951 CHEMBL362780::N-{[1-(4-Chloro-benzyl)-piperidin-3-ylcarbamoyl]-methyl}-3-methyl-benzamide
SMILES Cc1cccc(c1)C(=O)NCC(=O)NC1CCCN(Cc2ccc(Cl)cc2)C1
InChI Key InChIKey=VYDREHBKCZMYBF-UHFFFAOYSA-N
Data  1 IC50
  Tab Delimited (TSV)   2D SDfile   Computed 3D by Vconf -m prep SDfile
Find this compound or compounds like it in BindingDB:
Activity Spreadsheet -- Enzyme Inhibition Constant Data from BindingDB
Found 1 hit for monomerid = 50153951
TargetC-C chemokine receptor type 2(Homo sapiens (Human))
Deltagen Research Laboratories
Curated by ChEMBL
LigandPNGBDBM50153951(CHEMBL362780 | N-{[1-(4-Chloro-benzyl)-piperidin-3...)
Affinity DataIC50:  1.70E+4nM. Assay description: Concentration required to inhibit [125I]-MCP-1 binding to Chemokine receptor 2B
In DepthDetails ArticlePubMed