BDBM50154009 Acetic acid 17-acetyl-6-chloro-10,13-dimethyl-3-oxo-1,2,3,8,9,10,11,12,13,14,15,16,17,20-tetradecahydro-cyclopropa[1,2]cyclopenta[a]phenanthren-17-yl ester::CHEMBL361245
SMILES CC(=O)O[C@@]1(CCC2C3C=C(Cl)C4=CC(=O)[C@@H]5CC5[C@]4(C)C3CC[C@]12C)C(C)=O
InChI Key InChIKey=UWFYSQMTEOIJJG-JMDRYLRSSA-N
Data  4 IC50
  Tab Delimited (TSV)   2D SDfile   Computed 3D by Vconf -m prep SDfile
Find this compound or compounds like it in BindingDB:
Activity Spreadsheet -- Enzyme Inhibition Constant Data from BindingDB
Found 4 hits for monomerid = 50154009
TargetAndrogen receptor(Homo sapiens (Human))
The Pennsylvania State University
Curated by ChEMBL
LigandPNGBDBM50154009(Acetic acid 17-acetyl-6-chloro-10,13-dimethyl-3-ox...)
Affinity DataIC50:  22nM. Assay description: Inhibition of human androgen receptor expressed in Escherichia coli
In DepthDetails ArticlePubMed
TargetAndrogen receptor(Homo sapiens (Human))
The Pennsylvania State University
Curated by ChEMBL
LigandPNGBDBM50154009(Acetic acid 17-acetyl-6-chloro-10,13-dimethyl-3-ox...)
Affinity DataIC50:  61nM. Assay description: Inhibition of human lymph node carcinoma of prostate (LNCaP) cell proliferation
In DepthDetails ArticlePubMed
TargetAndrogen receptor(Homo sapiens (Human))
The Pennsylvania State University
Curated by ChEMBL
LigandPNGBDBM50154009(Acetic acid 17-acetyl-6-chloro-10,13-dimethyl-3-ox...)
Affinity DataIC50:  4.70nM. Assay description: Inhibition of AR-dimerization in CHO-K1 cells expressing human androgen receptor
In DepthDetails ArticlePubMed
TargetGlucocorticoid receptor(Homo sapiens (Human))
The Pennsylvania State University
Curated by ChEMBL
LigandPNGBDBM50154009(Acetic acid 17-acetyl-6-chloro-10,13-dimethyl-3-ox...)
Affinity DataIC50:  0.900nM. Assay description: Inhibition of CHO-K1 cells expressing glucocorticoid receptor
In DepthDetails ArticlePubMed