BDBM50154024 CHEMBL184273::Cyclohexyl-carbamic acid 3''-benzyl-biphenyl-3-yl ester
SMILES O=C(NC1CCCCC1)Oc1cccc(c1)-c1cccc(Cc2ccccc2)c1
InChI Key InChIKey=ZEXUNDKOGMQQQJ-UHFFFAOYSA-N
Data  1 IC50
  Tab Delimited (TSV)   2D SDfile   Computed 3D by Vconf -m prep SDfile
Find this compound or compounds like it in BindingDB:
Activity Spreadsheet -- Enzyme Inhibition Constant Data from BindingDB
Found 1 hit for monomerid = 50154024
TargetFatty-acid amide hydrolase 1 [30-579](Rattus norvegicus (rat))
Università
Curated by ChEMBL
LigandPNGBDBM50154024(CHEMBL184273 | Cyclohexyl-carbamic acid 3''-benzyl...)
Affinity DataIC50:  1.86E+3nM. Assay description: Inhibition of [3H]-anandamide binding to fatty acid amide hydrolase of rat brain membranes
In DepthDetails ArticlePubMed