BDBM50154502 Acetic acid 4-[(R)-5-(4-bromo-benzyl)-7-(3,5-dichloro-phenyl)-5-methyl-6-oxo-6,7-dihydro-5H-imidazo[1,2-a]imidazole-3-sulfonyl]-butyl ester::CHEMBL362120
SMILES CC(=O)OCCCCS(=O)(=O)c1cnc2N(C(=O)[C@@](C)(Cc3ccc(Br)cc3)n12)c1cc(Cl)cc(Cl)c1
InChI Key InChIKey=IJHCQZSIRPACKX-RUZDIDTESA-N
Data  1 Kd
  Tab Delimited (TSV)   2D SDfile   Computed 3D by Vconf -m prep SDfile
Find this compound or compounds like it in BindingDB:
Activity Spreadsheet -- Enzyme Inhibition Constant Data from BindingDB
Found 1 hit for monomerid = 50154502
TargetIntegrin alpha-L/beta-2(Homo sapiens (Human))
Boehringer Ingelheim Pharmaceuticals
Curated by ChEMBL
LigandPNGBDBM50154502(Acetic acid 4-[(R)-5-(4-bromo-benzyl)-7-(3,5-dichl...)
Affinity DataKd:  30nM. Assay description: Dissociation constant for human Lymphocyte function associated antigen 1 in LFA-1/ICAM-1 binding assay
In DepthDetails ArticlePubMed