BDBM50154555 CHEMBL3775916
SMILES [H][C@@]12C[C@](C)(CC[C@]1(C)CC[C@]1(C)C2=CC(=O)[C@]2([H])[C@@]3(C)CC[C@H](O)C(C)(C)[C@]3([H])CC[C@@]12C)C(N)=O
InChI Key InChIKey=CYOZWMBNVQNDKX-YKLVYJNSSA-N
Data  2 IC50
  Tab Delimited (TSV)   2D SDfile   Computed 3D by Vconf -m prep SDfile
Find this compound or compounds like it in BindingDB:
Activity Spreadsheet -- Enzyme Inhibition Constant Data from BindingDB
Found 2 hits for monomerid = 50154555
TargetCocaine esterase(Homo sapiens (Human))
Dalian Institute Of Chemical Physics
Curated by ChEMBL
LigandPNGBDBM50154555(CHEMBL3775916)
Affinity DataIC50:  1.42E+4nM. Assay description: Inhibition of CE2 in human liver microsomes using fluorescein diacetate as substrate preincubated for 10 mins followed by substrate addition measured...
In DepthDetails ArticlePubMed
TargetLiver carboxylesterase 1(Homo sapiens (Human))
Dalian Institute Of Chemical Physics
Curated by ChEMBL
LigandPNGBDBM50154555(CHEMBL3775916)
Affinity DataIC50:  6.99E+3nM. Assay description: Inhibition of CE1 in human liver microsomes using 2-(2-Benzoyl-3-methoxyphenyl) benzothiazole as substrate preincubated for 10 mins followed by subst...
In DepthDetails ArticlePubMed