BDBM50154646 4N-methyl-4N-phenyl-1-{3-[3-(4-methylanilino-1-pyridiniumylmethyl)phenyl]benzyl}-4-pyridiniumamine; bromide::CHEMBL364145
SMILES C[N+](c1ccccc1)=c1ccn(Cc2cccc(c2)-c2cccc(Cn3ccc(cc3)=[N+](C)c3ccccc3)c2)cc1
InChI Key InChIKey=GYXOGLBEBKHGRB-UHFFFAOYSA-N
Data  3 IC50
  Tab Delimited (TSV)   2D SDfile   Computed 3D by Vconf -m prep SDfile
Find this compound or compounds like it in BindingDB:
Activity Spreadsheet -- Enzyme Inhibition Constant Data from BindingDB
Found 3 hits for monomerid = 50154646
TargetCholine kinase alpha(Homo sapiens (Human))
Universidad De Grenada
Curated by ChEMBL
LigandPNGBDBM50154646(4N-methyl-4N-phenyl-1-{3-[3-(4-methylanilino-1-pyr...)
Affinity DataIC50:  400nM. Assay description: Inhibitory activity against human choline kinase enzyme
In DepthDetails ArticlePubMed
TargetCarboxylic ester hydrolase(Equus caballus (Horse))
Universidad De Granada
Curated by ChEMBL
LigandPNGBDBM50154646(4N-methyl-4N-phenyl-1-{3-[3-(4-methylanilino-1-pyr...)
Affinity DataIC50:  399nM. Assay description: Inhibition of equine BChE after 20 mins using butyrylthiocholine iodide as a substrate by Ellman's assay
In DepthDetails ArticlePubMed
TargetAcetylcholinesterase(Bos taurus (bovine))
Universidad De Granada
Curated by ChEMBL
LigandPNGBDBM50154646(4N-methyl-4N-phenyl-1-{3-[3-(4-methylanilino-1-pyr...)
Affinity DataIC50:  869nM. Assay description: Inhibition of bovine AChE after 20 mins using acetylthiocholine iodide as a substrate by Ellman's assay
In DepthDetails ArticlePubMed