BDBM50154760 CHEMBL3774449
SMILES COc1ccc(c(Cc2c(C)c(CC(O)=O)c3ccncn23)c1)S(=O)(=O)c1ccc(F)cc1
InChI Key InChIKey=FENFRFDEKBVTJI-UHFFFAOYSA-N
Data  2 IC50
  Tab Delimited (TSV)   2D SDfile   Computed 3D by Vconf -m prep SDfile
Find this compound or compounds like it in BindingDB:
Activity Spreadsheet -- Enzyme Inhibition Constant Data from BindingDB
Found 2 hits for monomerid = 50154760
TargetProstaglandin D2 receptor 2(Homo sapiens (Human))
RhôNe-Poulenc Rorer
Curated by ChEMBL
LigandPNGBDBM50154760(CHEMBL3774449)
Affinity DataIC50:  5nM. Assay description: Displacement of [35S]-GTPgammaS from CRTH2 receptor (unknown origin) expressed in CHOK1 cell membrane after 1 hr by liquid scintillation counter
In DepthDetails ArticlePubMed
TargetProstaglandin D2 receptor 2(Homo sapiens (Human))
RhôNe-Poulenc Rorer
Curated by ChEMBL
LigandPNGBDBM50154760(CHEMBL3774449)
Affinity DataIC50:  6nM. Assay description: Antagonist activity at CRTH2 receptor in human eosinophils by ESC assay
In DepthDetails ArticlePubMed