BDBM50154818 CHEMBL3775026
SMILES FC(F)(F)c1c(nnn1-c1ccccc1)C(=O)Nc1ccc(Oc2ccnc3[nH]ccc23)cc1
InChI Key InChIKey=VOMKUDNWGOHVBQ-UHFFFAOYSA-N
Data  1 IC50
  Tab Delimited (TSV)   2D SDfile   Computed 3D by Vconf -m prep SDfile
Find this compound or compounds like it in BindingDB:
Activity Spreadsheet -- Enzyme Inhibition Constant Data from BindingDB
Found 1 hit for monomerid = 50154818
TargetHepatocyte growth factor receptor(Homo sapiens (Human))
Jiangxi Science And Technology Normal University
Curated by ChEMBL
LigandPNGBDBM50154818(CHEMBL3775026)
Affinity DataIC50:  11nM. Assay description: Inhibition of cMet (unknown origin) using poly (Glu, Tyr) 4:1 as substrate after 30 mins by HTRF assay
In DepthDetails ArticlePubMed