BDBM50154931 CHEMBL3775792
SMILES CC(C)c1n[nH]c2c(NCc3ccc(cc3)-c3ccccn3)nc(NCC(C)(C)O)nc12
InChI Key InChIKey=BSQNZDHZPYKQMW-UHFFFAOYSA-N
Data  2 IC50
  Tab Delimited (TSV)   2D SDfile   Computed 3D by Vconf -m prep SDfile
Find this compound or compounds like it in BindingDB:
Activity Spreadsheet -- Enzyme Inhibition Constant Data from BindingDB
Found 2 hits for monomerid = 50154931
TargetCyclin-dependent kinase 2/G1/S-specific cyclin-E1(Homo sapiens (Human))
Palack£
Curated by ChEMBL
LigandPNGBDBM50154931(CHEMBL3775792)
Affinity DataIC50:  9nM. Assay description: Inhibition of CDK2/Cyclin E (unknown origin) expressed in sf9 cells using histone H1 as substrate in presence of [gamma33P]-ATP
In DepthDetails ArticlePubMed
TargetCyclin-dependent kinase 5(Homo sapiens (Human))
Palack£
Curated by ChEMBL
LigandPNGBDBM50154931(CHEMBL3775792)
Affinity DataIC50:  1nM. Assay description: Inhibition of CDK5 (unknown origin) using histone H1 as substrate in presence of [gamma33P]-ATP
In DepthDetails ArticlePubMed