BDBM50154947 CHEMBL3774757
SMILES Cn1cc(cn1)-c1ccc(Cc2n[nH]c3ccc(cc23)-c2nccn2C)cc1
InChI Key InChIKey=BGVLCUOYRCTJCU-UHFFFAOYSA-N
Data  2 IC50
  Tab Delimited (TSV)   2D SDfile   Computed 3D by Vconf -m prep SDfile
Find this compound or compounds like it in BindingDB:
Activity Spreadsheet -- Enzyme Inhibition Constant Data from BindingDB
Found 2 hits for monomerid = 50154947
TargetCyclin-dependent kinase 8(Homo sapiens (Human))
Merck
Curated by ChEMBL
LigandPNGBDBM50154947(CHEMBL3774757)
Affinity DataIC50:  1.90E+3nM. Assay description: Inhibition of CDK8 (unknown origin) expressed in 7dF3 clone of human HEK293 cells preincubated for 2 hrs followed by addition of beta-estradiol by lu...
In DepthDetails ArticlePubMed
TargetCyclin-C(Homo sapiens (Human))
Merck
Curated by ChEMBL
LigandPNGBDBM50154947(CHEMBL3774757)
Affinity DataIC50:  32nM. Assay description: Displacement of dye-labeled ATP competitive probe from recombinant human CDK8/Cyclin C incubated for 20 mins by Alexa647 probe-based FRET assay
In DepthDetails ArticlePubMed