BDBM50155466 2-(4-Dimethylamino-benzyl)-6-hydroxy-3,4-dihydro-2H-naphthalen-1-one::2-[4-(dimethylamino)benzyl]-6-hydroxy-3,4-dihydro-2H-naphthalen-1-one::CHEMBL361511
SMILES CN(C)c1ccc(CC2CCc3cc(O)ccc3C2=O)cc1
InChI Key InChIKey=BBZOYEHDIHOLNU-UHFFFAOYSA-N
Data  1 IC50
  Tab Delimited (TSV)   2D SDfile   Computed 3D by Vconf -m prep SDfile
Find this compound or compounds like it in BindingDB:
Activity Spreadsheet -- Enzyme Inhibition Constant Data from BindingDB
Found 1 hit for monomerid = 50155466
Target1,25-dihydroxyvitamin D(3) 24-hydroxylase, mitochondrial(Rattus norvegicus)
Cardiff University
Curated by ChEMBL
LigandPNGBDBM50155466(2-(4-Dimethylamino-benzyl)-6-hydroxy-3,4-dihydro-2...)
Affinity DataIC50:  1.80E+4nM. Assay description: Inhibitory activity against 25-hydroxyvitamin D3 24-hydroxylase of rat kidney mitochondria
In DepthDetails ArticlePubMed