BDBM50155472 6-Methoxy-2-[1-o-tolyl-meth-(E)-ylidene]-3,4-dihydro-2H-naphthalen-1-one::6-methoxy-2-[1-(2-methylphenyl)methylidene]-3,4-dihydro-2H-naphthlalen-1-one::CHEMBL188017
SMILES COc1ccc2C(=O)\C(CCc2c1)=C\c1ccccc1C
InChI Key InChIKey=WHQIWBZNJPZJEZ-LFIBNONCSA-N
Data  2 IC50
  Tab Delimited (TSV)   2D SDfile   Computed 3D by Vconf -m prep SDfile
Find this compound or compounds like it in BindingDB:
Activity Spreadsheet -- Enzyme Inhibition Constant Data from BindingDB
Found 2 hits for monomerid = 50155472
Target1,25-dihydroxyvitamin D(3) 24-hydroxylase, mitochondrial(Homo sapiens (Human))
Cardiff University
Curated by ChEMBL
LigandPNGBDBM50155472(6-Methoxy-2-[1-o-tolyl-meth-(E)-ylidene]-3,4-dihyd...)
Affinity DataIC50:  4.80E+5nM. Assay description: Inhibition of CYP24A1 expressed in CHO cells
In DepthDetails ArticlePubMed
Target1,25-dihydroxyvitamin D(3) 24-hydroxylase, mitochondrial(Rattus norvegicus)
Cardiff University
Curated by ChEMBL
LigandPNGBDBM50155472(6-Methoxy-2-[1-o-tolyl-meth-(E)-ylidene]-3,4-dihyd...)
Affinity DataIC50: >2.00E+4nM. Assay description: Inhibitory activity against 25-hydroxyvitamin D3 24-hydroxylase of rat kidney mitochondria
In DepthDetails ArticlePubMed