BDBM50155477 6-(hydroxy-2-(4-hydroxybenzyl)-3,4-dihydro-2H-naphthalen-1-one::6-Hydroxy-2-(4-hydroxy-benzyl)-3,4-dihydro-2H-naphthalen-1-one::CHEMBL186016
SMILES Oc1ccc(CC2CCc3cc(O)ccc3C2=O)cc1
InChI Key InChIKey=FEUVSYIDCDSZQO-UHFFFAOYSA-N
Data  1 IC50
  Tab Delimited (TSV)   2D SDfile   Computed 3D by Vconf -m prep SDfile
Find this compound or compounds like it in BindingDB:
Activity Spreadsheet -- Enzyme Inhibition Constant Data from BindingDB
Found 1 hit for monomerid = 50155477
Target1,25-dihydroxyvitamin D(3) 24-hydroxylase, mitochondrial(Rattus norvegicus)
Cardiff University
Curated by ChEMBL
LigandPNGBDBM50155477(6-(hydroxy-2-(4-hydroxybenzyl)-3,4-dihydro-2H-naph...)
Affinity DataIC50:  8.90E+3nM. Assay description: Inhibitory activity against 25-hydroxyvitamin D3 24-hydroxylase of rat kidney mitochondria
In DepthDetails ArticlePubMed